Reaction Details
TargetNADPH oxidase 1
LigandBDBM300417
Substrate/Competitorn/a
Meas. Tech.ROS Production Measurement on hNOX1 Membranes
Ki 32.0±n/a nM
Citation Machin, PSharpe, ALock, CJChambers, MSHodges, AAllen, VEllard, JM Amido thiadiazole derivatives as NADPH oxidase inhibitors US Patent US10130619 Publication Date 11/20/2018
 
NADPH oxidase 1
Name:NADPH oxidase 1
Type:PROTEIN
Mol. Mass.:64890.44
Organism:Homo sapiens (Human)
Description:ChEMBL_792877
Residue:564
BDBM300417
NameBDBM300417
Synonyms:US10130619, Example 180
TypeSmall organic molecule
Emp. Form.C23H21N5O3S
Mol. Mass.447.51
SMILESCOc1ccc(CCCOc2ccc(cn2)C(=O)Nc2nnc(s2)-c2ccncc2)cc1