Reaction Details
TargetProtein Wnt-3a
LigandBDBM300610
Substrate/Competitorn/a
Meas. Tech.HCT116 FOPFlash
IC50>50000±n/a nM
Comments0.000 12/22/2021
Citation Thede, KScott, WBender, EGolz, SHägebarth, ALienau, PPuehler, FBasting, DSchneider, DMöwes, MRichter, AZorn, LLiu, NMönning, USiegel, F Compounds US Patent US10130633 Publication Date 11/20/2018
 
Protein Wnt-3a
Name:Protein Wnt-3a
Type:PROTEIN
Mol. Mass.:39379.02
Organism:Homo sapiens (Human)
Description:ChEMBL_1469237
Residue:352
BDBM300610
NameBDBM300610
Synonyms:N-[6-(3,5- difluorophenyl)pyridin-3-yl]-3- ({(2R*)-2-[(1S,4S)-2-oxa-5- azabicyclo[2.2.1]hept-5- yl]propanoyl}amino)-4- (trifluoromethoxy)benzamide US10130633, Example 181
TypeSmall organic molecule
Emp. Form.C27H23F5N4O4
Mol. Mass.562.4879
SMILESCC(N1C[C@@H]2C[C@H]1CO2)C(=O)Nc1cc(ccc1OC(F)(F)F)C(=O)Nc1ccc(nc1)-c1cc(F)cc(F)c1