Reaction Details
TargetNeprilysin
LigandBDBM300705
Substrate/Competitorn/a
Meas. Tech.Enzyme Inhibition Assays
Ki<1.000±n/a nM
Citation Fleury, MGendron, RHughes, AD Neprilysin inhibitors US Patent US10130642 Publication Date 11/20/2018
 
Neprilysin
Name:Neprilysin
Type:Enzyme
Mol. Mass.:85505.38
Organism:Homo sapiens (Human)
Description:P08473
Residue:750
BDBM300705
NameBDBM300705
Synonyms:2S,4S)-5-Biphenyl-4-yl-2-hydroxymethyl-4-[(3H-[1,2,3]triazole-4-carbonyl)-amino]-pentanoic acid | US10130642, Example 1B
TypeSmall organic molecule
Emp. Form.C21H22N4O4
Mol. Mass.394.4238
SMILESOC[C@H](C[C@@H](Cc1ccc(cc1)-c1ccccc1)NC(=O)c1cnn[nH]1)C(O)=O