Reaction Details
TargetNeprilysin
LigandBDBM300709
Substrate/Competitorn/a
Meas. Tech.Enzyme Inhibition Assays
Ki<1.000±n/a nM
Citation Fleury, MGendron, RHughes, AD Neprilysin inhibitors US Patent US10130642 Publication Date 11/20/2018
 
Neprilysin
Name:Neprilysin
Type:Enzyme
Mol. Mass.:85505.38
Organism:Homo sapiens (Human)
Description:P08473
Residue:750
BDBM300709
NameBDBM300709
Synonyms:US10130642, Example 4-2
TypeSmall organic molecule
Emp. Form.C21H21FN4O4
Mol. Mass.412.4142
SMILESOCC(CC(Cc1ccc(cc1)-c1ccccc1F)NC(=O)c1cnn[nH]1)C(O)=O