Reaction Details
TargetNeprilysin
LigandBDBM300731
Substrate/Competitorn/a
Meas. Tech.Enzyme Inhibition Assays
Ki<1.000±n/a nM
Citation Fleury, MGendron, RHughes, AD Neprilysin inhibitors US Patent US10130642 Publication Date 11/20/2018
 
Neprilysin
Name:Neprilysin
Type:Enzyme
Mol. Mass.:85505.38
Organism:Homo sapiens (Human)
Description:P08473
Residue:750
BDBM300731
NameBDBM300731
Synonyms:US10130642, Example 4-27
TypeSmall organic molecule
Emp. Form.C22H22ClN3O4
Mol. Mass.427.881
SMILESOCC(CC(Cc1ccccc1)NC(=O)c1cc(n[nH]1)-c1ccccc1Cl)C(O)=O