Reaction Details
TargetSmall conductance calcium-activated potassium channel protein 1
LigandBDBM168436
Substrate/Competitorn/a
Meas. Tech.Voltage-Clamp Assay
pH7.35±n/a
Temperature298.15±n/a K
EC50>1.00e+5±n/a nM
Commentsextracted
Citation PubChem, PCWulff, HColeman, NJenkins, DP Methods for treating seizure disorders and pain US Patent US9675591 Publication Date 6/13/2017
 
Small conductance calcium-activated potassium channel protein 1
Name:Small conductance calcium-activated potassium channel protein 1
Type:Protein
Mol. Mass.:60005.90
Organism:Homo sapiens (Human)
Description:Q92952
Residue:543
BDBM168436
NameBDBM168436
Synonyms:US9675591, SKA-19
TypeSmall organic molecule
Emp. Form.C8H5F3N2S2
Mol. Mass.250.264
SMILESNc1nc2ccc(SC(F)(F)F)cc2s1