Reaction Details
TargetEstrogen receptor
LigandBDBM300933
Substrate/Competitorn/a
Meas. Tech.MCF-7 ER Down-Regulation Assay
IC50 0.055±n/a nM
Citation Barlaam, BCO Donovan, DHHughes, SJMoss, TANissink, JWScott, JSYang, B Chemical compounds US Patent US10131663 Publication Date 11/20/2018
 
Estrogen receptor
Name:Estrogen receptor
Type:Protein
Mol. Mass.:66230.44
Organism:Homo sapiens (Human)
Description:P03372
Residue:595
BDBM300933
NameBDBM300933
Synonyms:N-(3,5-difluoro-4-((6S,8R)-8-methyl-7-(2,2,2-trifluoroethyl)-6,7,8,9-tetrahydro-3H-pyrazolo[4,3-f]isoquinolin-6-yl)phenyl)-1-(3-fluoropropyl)azetidin-3-amine US10590130, Example 8 | US10961241, Example 8
TypeSmall organic molecule
Emp. Form.C25H27F6N5
Mol. Mass.511.5058
SMILESC[C@@H]1Cc2c(ccc3[nH]ncc23)[C@H](N1CC(F)(F)F)c1c(F)cc(NC2CN(CCCF)C2)cc1F