Reaction Details
TargetLysine-specific histone demethylase 1A
LigandBDBM301072
Substrate/Competitorn/a
Meas. Tech.In Vitro Enzyme Inhibition Assay - LSD-1
IC50<10±n/a nM
Citation Chen, YKKanouni, TKaldor, SWStafford, JAVeal, JM Inhibitors of lysine specific demethylase-1 US Patent US10131664 Publication Date 11/20/2018
 
Lysine-specific histone demethylase 1A
Name:Lysine-specific histone demethylase 1A
Type:Enzyme
Mol. Mass.:92901.01
Organism:Homo sapiens (Human)
Description:O60341
Residue:852
BDBM301072
NameBDBM301072
Synonyms:4-[2-(2,3,3a,4,5,7,8,8a-octahydro-1H- pyrrolo[3,4-d]azepin-6-yl)-5-(1- methylpyrazolo[3,4-b]pyridin-5- yl)pyrimidin-4-yl]benzonitrile | US10131664, Example 65
TypeSmall organic molecule
Emp. Form.C26H26N8
Mol. Mass.450.5382
SMILESCn1ncc2cc(cnc12)-c1cnc(nc1-c1ccc(cc1)C#N)N1CCC2CNCC2CC1