Reaction Details
TargetLysine-specific histone demethylase 1A
LigandBDBM301075
Substrate/Competitorn/a
Meas. Tech.In Vitro Enzyme Inhibition Assay - LSD-1
IC50<10±n/a nM
Citation Chen, YKKanouni, TKaldor, SWStafford, JAVeal, JM Inhibitors of lysine specific demethylase-1 US Patent US10131664 Publication Date 11/20/2018
 
Lysine-specific histone demethylase 1A
Name:Lysine-specific histone demethylase 1A
Type:Enzyme
Mol. Mass.:92901.01
Organism:Homo sapiens (Human)
Description:O60341
Residue:852
BDBM301075
NameBDBM301075
Synonyms:4-[2-(4-aminopiperidin-1-yl)-5-(2- methylpyrazolo[4,3-b]pyridin-5- yl)pyrimidin-4-yl]benzonitrile US10131664, Example 68
TypeSmall organic molecule
Emp. Form.C23H22N8
Mol. Mass.410.4744
SMILESCn1ncc2cc(ncc12)-c1cnc(nc1-c1ccc(cc1)C#N)N1CCC(N)CC1