Reaction Details
TargetLysine-specific histone demethylase 1A
LigandBDBM301094
Substrate/Competitorn/a
Meas. Tech.In Vitro Enzyme Inhibition Assay - LSD-1
IC50<10±n/a nM
Citation Chen, YKKanouni, TKaldor, SWStafford, JAVeal, JM Inhibitors of lysine specific demethylase-1 US Patent US10131664 Publication Date 11/20/2018
 
Lysine-specific histone demethylase 1A
Name:Lysine-specific histone demethylase 1A
Type:Enzyme
Mol. Mass.:92901.01
Organism:Homo sapiens (Human)
Description:O60341
Residue:852
BDBM301094
NameBDBM301094
Synonyms:4-[2-(4-aminopiperidin-1-yl)-5-(1- methylbenzimidazol-5-yl)pyrimidin-4- yl]-2-fluorobenzonitrile | US10131664, Example 87
TypeSmall organic molecule
Emp. Form.C24H22FN7
Mol. Mass.427.4768
SMILESCn1cnc2cc(ccc12)-c1cnc(nc1-c1ccc(C#N)c(F)c1)N1CCC(N)CC1