Reaction Details
TargetEndothelin-1
LigandBDBM168441
Substrate/Competitorn/a
Meas. Tech.ET-1 Assay
EC50>200000±n/a nM
Citation PubChem, PCBuckman, BONicholas, JBRamphal, JYEmayan, KSeiwert, SD Anti-fibrotic pyridinones US Patent US9675593 Publication Date 6/13/2017
 
Endothelin-1
Name:Endothelin-1
Type:Protein
Mol. Mass.:24444.51
Organism:Homo sapiens (Human)
Description:P05305
Residue:212
BDBM168441
NameBDBM168441
Synonyms:US9675593, 14
TypeSmall organic molecule
Emp. Form.C14H13NO3
Mol. Mass.243.2579
SMILESCOc1cccc(c1)-n1cc(ccc1=O)C(C)=O