Reaction Details
TargetEndothelin-1
LigandBDBM168462
Substrate/Competitorn/a
Meas. Tech.ET-1 Assay
EC50>200000±n/a nM
Citation PubChem, PCBuckman, BONicholas, JBRamphal, JYEmayan, KSeiwert, SD Anti-fibrotic pyridinones US Patent US9675593 Publication Date 6/13/2017
 
Endothelin-1
Name:Endothelin-1
Type:Protein
Mol. Mass.:24444.51
Organism:Homo sapiens (Human)
Description:P05305
Residue:212
BDBM168462
NameBDBM168462
Synonyms:US9675593, 24
TypeSmall organic molecule
Emp. Form.C18H19N3O3
Mol. Mass.325.3618
SMILESCOCCOc1ccc(cc1)-n1cc(-c2cn[nH]c2)c(C)cc1=O