Reaction Details
TargetEndothelin-1
LigandBDBM168477
Substrate/Competitorn/a
Meas. Tech.ET-1 Assay
EC50 125000±n/a nM
Citation PubChem, PCBuckman, BONicholas, JBRamphal, JYEmayan, KSeiwert, SD Anti-fibrotic pyridinones US Patent US9675593 Publication Date 6/13/2017
 
Endothelin-1
Name:Endothelin-1
Type:Protein
Mol. Mass.:24444.51
Organism:Homo sapiens (Human)
Description:P05305
Residue:212
BDBM168477
NameBDBM168477
Synonyms:US9675593, 37
TypeSmall organic molecule
Emp. Form.C19H16F3N3O2
Mol. Mass.375.3444
SMILESFC(F)(F)Oc1ccc(cc1)-n1cc(-c2cn[nH]c2)c2CCCCc2c1=O