Reaction Details
TargetEndothelin-1
LigandBDBM168491
Substrate/Competitorn/a
Meas. Tech.ET-1 Assay
EC50>200000±n/a nM
Citation PubChem, PCBuckman, BONicholas, JBRamphal, JYEmayan, KSeiwert, SD Anti-fibrotic pyridinones US Patent US9675593 Publication Date 6/13/2017
 
Endothelin-1
Name:Endothelin-1
Type:Protein
Mol. Mass.:24444.51
Organism:Homo sapiens (Human)
Description:P05305
Residue:212
BDBM168491
NameBDBM168491
Synonyms:US9675593, 53
TypeSmall organic molecule
Emp. Form.C21H14F4N2O4
Mol. Mass.434.3405
SMILESCN1C(=O)COc2c(cn(-c3ccc(OC(F)(F)F)cc3)c(=O)c12)-c1ccc(F)cc1