Reaction Details
TargetEndothelin-1
LigandBDBM171390
Substrate/Competitorn/a
Meas. Tech.ET-1 Assay
EC50<50000±n/a nM
Citation PubChem, PCBuckman, BONicholas, JBRamphal, JYEmayan, KSeiwert, SD Anti-fibrotic pyridinones US Patent US9675593 Publication Date 6/13/2017
 
Endothelin-1
Name:Endothelin-1
Type:Protein
Mol. Mass.:24444.51
Organism:Homo sapiens (Human)
Description:P05305
Residue:212
BDBM171390
NameBDBM171390
Synonyms:US9675593, 376
TypeSmall organic molecule
Emp. Form.C17H17N3O2
Mol. Mass.295.3358
SMILESCCOc1ccc(c(C)c1)-n1cc(ccc1=O)-c1cn[nH]c1