Reaction Details
TargetEndothelin-1
LigandBDBM172317
Substrate/Competitorn/a
Meas. Tech.ET-1 Assay
EC50<50000±n/a nM
Citation PubChem, PCBuckman, BONicholas, JBRamphal, JYEmayan, KSeiwert, SD Anti-fibrotic pyridinones US Patent US9675593 Publication Date 6/13/2017
 
Endothelin-1
Name:Endothelin-1
Type:Protein
Mol. Mass.:24444.51
Organism:Homo sapiens (Human)
Description:P05305
Residue:212
BDBM172317
NameBDBM172317
Synonyms:US9675593, 391
TypeSmall organic molecule
Emp. Form.C17H14F3N3O2
Mol. Mass.349.3072
SMILESCc1c(cnn1C)-c1ccc(=O)n(c1)-c1ccc(OC(F)(F)F)cc1