Reaction Details
TargetEndothelin-1
LigandBDBM172581
Substrate/Competitorn/a
Meas. Tech.ET-1 Assay
EC50<50000±n/a nM
Citation PubChem, PCBuckman, BONicholas, JBRamphal, JYEmayan, KSeiwert, SD Anti-fibrotic pyridinones US Patent US9675593 Publication Date 6/13/2017
 
Endothelin-1
Name:Endothelin-1
Type:Protein
Mol. Mass.:24444.51
Organism:Homo sapiens (Human)
Description:P05305
Residue:212
BDBM172581
NameBDBM172581
Synonyms:US9675593, 647
TypeSmall organic molecule
Emp. Form.C21H19F3N4O2
Mol. Mass.416.3964
SMILESCC(C)n1ccc2c(cn(-c3ccc(OC(F)(F)F)cc3)c(=O)c12)-c1cnn(C)c1