Reaction Details
TargetEndothelin-1
LigandBDBM172584
Substrate/Competitorn/a
Meas. Tech.ET-1 Assay
EC50<50000±n/a nM
Citation PubChem, PCBuckman, BONicholas, JBRamphal, JYEmayan, KSeiwert, SD Anti-fibrotic pyridinones US Patent US9675593 Publication Date 6/13/2017
 
Endothelin-1
Name:Endothelin-1
Type:Protein
Mol. Mass.:24444.51
Organism:Homo sapiens (Human)
Description:P05305
Residue:212
BDBM172584
NameBDBM172584
Synonyms:US9675593, 650
TypeSmall organic molecule
Emp. Form.C20H15F3N4O2
Mol. Mass.400.3539
SMILESFC(F)(F)Oc1ccc(cc1)-n1cc(-c2cn[nH]c2)c2ccn(C3CC3)c2c1=O