Reaction Details
TargetEndothelin-1
LigandBDBM172587
Substrate/Competitorn/a
Meas. Tech.ET-1 Assay
EC50<50000±n/a nM
Citation PubChem, PCBuckman, BONicholas, JBRamphal, JYEmayan, KSeiwert, SD Anti-fibrotic pyridinones US Patent US9675593 Publication Date 6/13/2017
 
Endothelin-1
Name:Endothelin-1
Type:Protein
Mol. Mass.:24444.51
Organism:Homo sapiens (Human)
Description:P05305
Residue:212
BDBM172587
NameBDBM172587
Synonyms:US9675593, 665
TypeSmall organic molecule
Emp. Form.C18H14F3N5O2
Mol. Mass.389.3313
SMILESCn1cc(cn1)-c1cn(-c2ccc(OC(F)(F)F)cc2)c(=O)c2n(C)cnc12