Reaction Details
TargetEndothelin-1
LigandBDBM172590
Substrate/Competitorn/a
Meas. Tech.ET-1 Assay
EC50<50000±n/a nM
Citation PubChem, PCBuckman, BONicholas, JBRamphal, JYEmayan, KSeiwert, SD Anti-fibrotic pyridinones US Patent US9675593 Publication Date 6/13/2017
 
Endothelin-1
Name:Endothelin-1
Type:Protein
Mol. Mass.:24444.51
Organism:Homo sapiens (Human)
Description:P05305
Residue:212
BDBM172590
NameBDBM172590
Synonyms:US9675593, 667
TypeSmall organic molecule
Emp. Form.C19H15FO3
Mol. Mass.310.319
SMILESCCOc1ccc(-c2c(-c3ccc(F)cc3)c(=O)c2=O)c(C)c1