Reaction Details
TargetEndothelin-1
LigandBDBM172591
Substrate/Competitorn/a
Meas. Tech.ET-1 Assay
EC50<50000±n/a nM
Citation PubChem, PCBuckman, BONicholas, JBRamphal, JYEmayan, KSeiwert, SD Anti-fibrotic pyridinones US Patent US9675593 Publication Date 6/13/2017
 
Endothelin-1
Name:Endothelin-1
Type:Protein
Mol. Mass.:24444.51
Organism:Homo sapiens (Human)
Description:P05305
Residue:212
BDBM172591
NameBDBM172591
Synonyms:US9675593, 669
TypeSmall organic molecule
Emp. Form.C18H14F3N5O2
Mol. Mass.389.3313
SMILESCCn1cnc2c(cn(-c3ccc(OC(F)(F)F)cc3)c(=O)c12)-c1cn[nH]c1