Reaction Details
TargetEndothelin-1
LigandBDBM172885
Substrate/Competitorn/a
Meas. Tech.ET-1 Assay
EC50<50000±n/a nM
Citation PubChem, PCBuckman, BONicholas, JBRamphal, JYEmayan, KSeiwert, SD Anti-fibrotic pyridinones US Patent US9675593 Publication Date 6/13/2017
 
Endothelin-1
Name:Endothelin-1
Type:Protein
Mol. Mass.:24444.51
Organism:Homo sapiens (Human)
Description:P05305
Residue:212
BDBM172885
NameBDBM172885
Synonyms:US9675593, 694
TypeSmall organic molecule
Emp. Form.C20H17F3N4O2
Mol. Mass.402.3698
SMILESCCn1ccc2c1c(cn(-c1ccc(OC(F)(F)F)cc1)c2=O)-c1cnn(C)c1