Reaction Details
TargetEndothelin-1
LigandBDBM173074
Substrate/Competitorn/a
Meas. Tech.ET-1 Assay
EC50<50000±n/a nM
Citation PubChem, PCBuckman, BONicholas, JBRamphal, JYEmayan, KSeiwert, SD Anti-fibrotic pyridinones US Patent US9675593 Publication Date 6/13/2017
 
Endothelin-1
Name:Endothelin-1
Type:Protein
Mol. Mass.:24444.51
Organism:Homo sapiens (Human)
Description:P05305
Residue:212
BDBM173074
NameBDBM173074
Synonyms:US9675593, 702
TypeSmall organic molecule
Emp. Form.C25H24F2N4O2
Mol. Mass.450.4805
SMILESCCOc1ccc(c(C)c1)-n1cc(-c2cnn(C)c2)c(NCc2ccc(F)cc2F)cc1=O