Reaction Details
TargetEndothelin-1
LigandBDBM173093
Substrate/Competitorn/a
Meas. Tech.ET-1 Assay
EC50<50000±n/a nM
Citation PubChem, PCBuckman, BONicholas, JBRamphal, JYEmayan, KSeiwert, SD Anti-fibrotic pyridinones US Patent US9675593 Publication Date 6/13/2017
 
Endothelin-1
Name:Endothelin-1
Type:Protein
Mol. Mass.:24444.51
Organism:Homo sapiens (Human)
Description:P05305
Residue:212
BDBM173093
NameBDBM173093
Synonyms:US9675593, 707
TypeSmall organic molecule
Emp. Form.C28H32N4O4
Mol. Mass.488.5781
SMILESCCOc1ccc(c(C)c1)-n1cc(-c2cnn(C)c2)c(NCc2ccc(OCCOC)cc2)cc1=O