Reaction Details
TargetMitogen-activated protein kinase kinase kinase 12
LigandBDBM301519
Substrate/Competitorn/a
Meas. Tech.DLK TR-FRET Inhibition Assay
Ki 9.74±n/a nM
Citation Estrada, APatel, SKellar, THuestis, MShore, DSiu, M Tricyclic DLK inhibitors and uses thereof US Patent US10131675 Publication Date 11/20/2018
 
Mitogen-activated protein kinase kinase kinase 12
Name:Mitogen-activated protein kinase kinase kinase 12
Type:PROTEIN
Mol. Mass.:93216.56
Organism:Homo sapiens (Human)
Description:ChEMBL_1460553
Residue:859
BDBM301519
NameBDBM301519
Synonyms:US10131675, Example 4
TypeSmall organic molecule
Emp. Form.C21H22FN7O
Mol. Mass.407.4441
SMILESCc1c[nH]c2ncc(cc12)-c1nc(N2CC(F)C2)c2nc3n(CCOC3(C)C)c2n1