Reaction Details
TargetMitogen-activated protein kinase kinase kinase 12
LigandBDBM301601
Substrate/Competitorn/a
Meas. Tech.DLK TR-FRET Inhibition Assay
Ki 14.0±n/a nM
Citation Estrada, APatel, SKellar, THuestis, MShore, DSiu, M Tricyclic DLK inhibitors and uses thereof US Patent US10131675 Publication Date 11/20/2018
 
Mitogen-activated protein kinase kinase kinase 12
Name:Mitogen-activated protein kinase kinase kinase 12
Type:PROTEIN
Mol. Mass.:93216.56
Organism:Homo sapiens (Human)
Description:ChEMBL_1460553
Residue:859
BDBM301601
NameBDBM301601
Synonyms:US10131675, Example 87
TypeSmall organic molecule
Emp. Form.C19H17F3N6O2
Mol. Mass.418.3725
SMILESCOc1nc(nc2n3CCOC(C)(C)c3nc12)-c1cnc2[nH]cc(c2c1)C(F)(F)F