Reaction Details
TargetSodium channel protein type 9 subunit alpha
LigandBDBM258126
Substrate/Competitorn/a
Meas. Tech.Electrophysiological Assay
IC50 46.0±n/a nM
Citation Takahashi, SDomon, YKitano, YShinozuka, T Drugs for treating respiratory diseases US Patent US9597330 Publication Date 3/21/2017
 
Sodium channel protein type 9 subunit alpha
Name:Sodium channel protein type 9 subunit alpha
Type:Protein
Mol. Mass.:226375.97
Organism:Homo sapiens (Human)
Description:Q15858
Residue:1988
BDBM258126
NameBDBM258126
Synonyms:US9493448, 28 US9845313, Example 28
TypeSmall organic molecule
Emp. Form.C21H23F2N5O3S
Mol. Mass.463.501
SMILESCCn1nccc1[C@H]1CCCC[C@@H]1Oc1cc(F)c(cc1F)S(=O)(=O)Nc1ccncn1