Reaction Details
TargetSodium channel protein type 9 subunit alpha
LigandBDBM258219
Substrate/Competitorn/a
Meas. Tech.Electrophysiological Assay
IC50 14.0±n/a nM
Citation Takahashi, SDomon, YKitano, YShinozuka, T Drugs for treating respiratory diseases US Patent US9597330 Publication Date 3/21/2017
 
Sodium channel protein type 9 subunit alpha
Name:Sodium channel protein type 9 subunit alpha
Type:Protein
Mol. Mass.:226375.97
Organism:Homo sapiens (Human)
Description:Q15858
Residue:1988
BDBM258219
NameBDBM258219
Synonyms:US9493448, 126 US9845313, Example 126
TypeSmall organic molecule
Emp. Form.C21H22F3N5O3S
Mol. Mass.481.491
SMILESCc1cc(c(F)cc1O[C@H]1CCC(F)(F)C[C@@H]1c1ccnn1C)S(=O)(=O)Nc1ccncn1