Reaction Details
TargetN-lysine methyltransferase SMYD2
LigandBDBM50095537
Substrate/Competitorn/a
Meas. Tech.Binding Affinity Assay
IC50 23.0±n/a nM
Citation Chiang, GGPappano, WNSweis, RFWang, Z SMYD2 inhibitors US Patent US9598381 Publication Date 3/21/2017
 
N-lysine methyltransferase SMYD2
Name:N-lysine methyltransferase SMYD2
Type:Enzyme
Mol. Mass.:49689.57
Organism:Homo sapiens (Human)
Description:Q9NRG4
Residue:433
BDBM50095537
NameBDBM50095537
Synonyms:CHEMBL3590526 | US9598381, 1a (S enantiomer)
TypeSmall organic molecule
Emp. Form.C29H38Cl2N4O4
Mol. Mass.577.542
SMILESO[C@@H](CNCCN(C1CCCCC1)C(=O)CCNCCc1ccc(Cl)c(Cl)c1)c1cccc2NC(=O)COc12