Reaction Details
TargetPoly [ADP-ribose] polymerase 1
LigandBDBM301928
Substrate/Competitorn/a
Meas. Tech.In Vitro Scintillation Proximity Assay (SPA)
IC50 0.977±n/a nM
Citation Angibaud, PRMevellec, LARoux, BStorck, PMeyer, CVialard, JE Tetrahydrophenanthridinones and tetrahydrocyclopentaquinolinones as PARP and tubulin polymerization inhibitors US Patent US9598396 Publication Date 3/21/2017
 
Poly [ADP-ribose] polymerase 1
Name:Poly [ADP-ribose] polymerase 1
Type:n/a
Mol. Mass.:113114.22
Organism:Homo sapiens (Human)
Description:P09874
Residue:1014
BDBM301928
NameBDBM301928
Synonyms:US9598396, Compound 5
TypeSmall organic molecule
Emp. Form.C23H21FN2O
Mol. Mass.360.424
SMILESCC(Cc1cccc(F)c1)(C#N)c1ccc2c3CCCCc3c(=O)[nH]c2c1