Reaction Details
Target5-hydroxytryptamine receptor 1A
LigandBDBM301950
Substrate/Competitorn/a
Meas. Tech.Binding Affinity Human 5-HT1A Receptor Test
Ki 2.80±n/a nM
Citation Zhang, YJin, CZhou, R Substituted heteroaryl compounds and methods of use thereof US Patent US9598401 Publication Date 3/21/2017
 
5-hydroxytryptamine receptor 1A
Name:5-hydroxytryptamine receptor 1A
Type:n/a
Mol. Mass.:46122.49
Organism:Homo sapiens (Human)
Description:n/a
Residue:422
BDBM301950
NameBDBM301950
Synonyms:3-(4-(4-(4,6-Dimethoxypyrimidin-2-yl)piperazin-1-yl)butyl)-5-fluoro-1H-indole | US9598401, Example 4
TypeSmall organic molecule
Emp. Form.C22H28FN5O2
Mol. Mass.413.4884
SMILESCOc1cc(OC)nc(n1)N1CCN(CCCCc2c[nH]c3ccc(F)cc23)CC1