Reaction Details
Target5-hydroxytryptamine receptor 1A
LigandBDBM301977
Substrate/Competitorn/a
Meas. Tech.Binding Affinity Human 5-HT1A Receptor Test
Ki 2.00±n/a nM
Citation Zhang, YJin, CZhou, R Substituted heteroaryl compounds and methods of use thereof US Patent US9598401 Publication Date 3/21/2017
 
5-hydroxytryptamine receptor 1A
Name:5-hydroxytryptamine receptor 1A
Type:n/a
Mol. Mass.:46122.49
Organism:Homo sapiens (Human)
Description:n/a
Residue:422
BDBM301977
NameBDBM301977
Synonyms:5-Fluoro-3-(4-(4-(4-(trifluoromethyl)pyrimidin-2-yl)piperazin-1-yl)butyl)-1H-indole | US9598401, Example 31
TypeSmall organic molecule
Emp. Form.C21H23F4N5
Mol. Mass.421.4344
SMILESFc1ccc2[nH]cc(CCCCN3CCN(CC3)c3nccc(n3)C(F)(F)F)c2c1