Reaction Details
Target5-hydroxytryptamine receptor 1A
LigandBDBM301983
Substrate/Competitorn/a
Meas. Tech.Binding Affinity Human 5-HT1A Receptor Test
Ki 0.790±n/a nM
Citation Zhang, YJin, CZhou, R Substituted heteroaryl compounds and methods of use thereof US Patent US9598401 Publication Date 3/21/2017
 
5-hydroxytryptamine receptor 1A
Name:5-hydroxytryptamine receptor 1A
Type:n/a
Mol. Mass.:46122.49
Organism:Homo sapiens (Human)
Description:n/a
Residue:422
BDBM301983
NameBDBM301983
Synonyms:Ethyl 2-(4-(4-(5-cyano-1H-indol-3-yl)butyl)piperazin-1-yl)-4-methylthiazole-5-carboxylate | US9598401, Example 39
TypeSmall organic molecule
Emp. Form.C24H29N5O2S
Mol. Mass.451.584
SMILESCCOC(=O)c1sc(nc1C)N1CCN(CCCCc2c[nH]c3ccc(cc23)C#N)CC1