Reaction Details
TargetTyrosine-protein kinase SYK
LigandBDBM302016
Substrate/Competitorn/a
Meas. Tech.Homogeneous Time-Resolved Fluorescence (HTRF) Assay
IC50 0.073±n/a nM
Citation Altman, MDAndresen, BMArrington, KLChilders, KKDi Francesco, MEEllis, JMHaidle, AMLiu, YNorthrup, ABO Boyle, BOtte, RDReutershan, MHVitharana, DWoo, HC Thiazole-substituted aminopyridines as spleen tyrosine kinase inhibitors US Patent US9598405 Publication Date 3/21/2017
 
Tyrosine-protein kinase SYK
Name:Tyrosine-protein kinase SYK
Type:Enzyme
Mol. Mass.:72079.99
Organism:Homo sapiens (Human)
Description:P43405
Residue:635
BDBM302016
NameBDBM302016
Synonyms:US9598405, 3.1
TypeSmall Organic Molecule
Emp. Form.C24H25F3N4O3S
Mol. Mass.506.541
SMILESCc1cc(Nc2cc(ccn2)C(F)(F)F)nc(c1)-c1cnc(s1)[C@]1(O)CC[C@@H](C(O)=O)C(C)(C)C1