Reaction Details
TargetTyrosine-protein kinase SYK
LigandBDBM302032
Substrate/Competitorn/a
Meas. Tech.Homogeneous Time-Resolved Fluorescence (HTRF) Assay
IC50 0.113±n/a nM
Citation Altman, MDAndresen, BMArrington, KLChilders, KKDi Francesco, MEEllis, JMHaidle, AMLiu, YNorthrup, ABO Boyle, BOtte, RDReutershan, MHVitharana, DWoo, HC Thiazole-substituted aminopyridines as spleen tyrosine kinase inhibitors US Patent US9598405 Publication Date 3/21/2017
 
Tyrosine-protein kinase SYK
Name:Tyrosine-protein kinase SYK
Type:Enzyme
Mol. Mass.:72079.99
Organism:Homo sapiens (Human)
Description:P43405
Residue:635
BDBM302032
NameBDBM302032
Synonyms:US9598405, 3.17
TypeSmall Organic Molecule
Emp. Form.C24H28N4O3S
Mol. Mass.452.569
SMILESCc1ccnc(Nc2cc(C)cc(n2)-c2cnc(s2)[C@@]2(O)CC[C@H](C(O)=O)C(C)(C)C2)c1