Reaction Details
TargetPotassium channel subfamily K member 3
LigandBDBM179631
Substrate/Competitorn/a
Meas. Tech.Activity Assay
IC50 216±n/a nM
Citation Bialy, LLorenz, KWirth, KSteinmeyer, KHessler, GPernerstorfer, JBrendel, J Substituted 4,5,6,7-tetrahydro-1H-pyrazolo[4,3-C]pyridines, their use as medicament, and pharmaceutical preparations comprising them US Patent US9598410 Publication Date 3/21/2017
 
Potassium channel subfamily K member 3
Name:Potassium channel subfamily K member 3
Type:Protein
Mol. Mass.:43534.71
Organism:Homo sapiens (Human)
Description:O14649
Residue:394
BDBM179631
NameBDBM179631
Synonyms:US9127001, 6i | US9598410, Compound 6i
TypeSmall organic molecule
Emp. Form.C21H17F5N4O
Mol. Mass.436.3779
SMILESCC(=O)N1CCc2c(C1)c(nn2Cc1ccc(F)cc1F)-c1cccc(n1)C(F)(F)F