Reaction Details
TargetPotassium channel subfamily K member 3
LigandBDBM179713
Substrate/Competitorn/a
Meas. Tech.Activity Assay
IC50 246±n/a nM
Citation Bialy, LLorenz, KWirth, KSteinmeyer, KHessler, GPernerstorfer, JBrendel, J Substituted 4,5,6,7-tetrahydro-1H-pyrazolo[4,3-C]pyridines, their use as medicament, and pharmaceutical preparations comprising them US Patent US9598410 Publication Date 3/21/2017
 
Potassium channel subfamily K member 3
Name:Potassium channel subfamily K member 3
Type:Protein
Mol. Mass.:43534.71
Organism:Homo sapiens (Human)
Description:O14649
Residue:394
BDBM179713
NameBDBM179713
Synonyms:US9127001, 8t | US9598410, Compound 8t
TypeSmall organic molecule
Emp. Form.C26H19F2N5O
Mol. Mass.455.4588
SMILESFc1ccc(Cn2nc(c3CN(CCc23)C(=O)c2ccccn2)-c2cccc(c2)C#N)c(F)c1