BDBM10215 2-(2,3-dihydro-1,4-benzodioxin-2-yl)-4-[3-(trifluoromethyl)phenyl]-1,3-thiazole::BI-9B12::Burnham Institute Compound 1
SMILES: FC(F)(F)c1cccc(c1)-c1csc(n1)C1COc2ccccc2O1
InChI Key: InChIKey=FPXQYPGVDNEQKU-UHFFFAOYSA-N
Data: 3 KI
Activity Spreadsheet -- Enzyme Inhibition Constant Data from BindingDB
Found 3 hits for monomerid = 10215
Trg + Lig
Ki
nM
ΔG°
kcal/mole
IC50
nM
Kd
nM
EC50/IC50
nM
koff
s-1
kon
M-1s-1
pHTemp
°C
Caspase-8
(Homo sapiens (Human))
BDBM10215
(2-(2,3-dihydro-1,4-benzodioxin-2-yl)-4-[3-(trifluo...)
Show SMILES FC(F)(F)c1cccc(c1)-c1csc(n1)C1COc2ccccc2O1
Show InChI InChI=1S/C18H12F3NO2S/c19-18(20,21)12-5-3-4-11(8-12)13-10-25-17(22-13)16-9-23-14-6-1-2-7-15(14)24-16/h1-8,10,16H,9H2
NCI pathway
Reactome pathway
2.70E+3n/an/an/an/an/an/an/an/a
Burnham Institute
Assay Description
Fluorescent assays were carried out in black 96-well plates. Caspase activity was monitored using a Labsystem Fluoroskan II spectrofluorometer with a...
J Med Chem 48: 1649-56 (2005)
Article DOI: 10.1021/jm0493212
BindingDB Entry DOI: 10.7270/Q2GT5KDJ
Caspase-3
(Homo sapiens (Human))
BDBM10215
(2-(2,3-dihydro-1,4-benzodioxin-2-yl)-4-[3-(trifluo...)
Show SMILES FC(F)(F)c1cccc(c1)-c1csc(n1)C1COc2ccccc2O1
Show InChI InChI=1S/C18H12F3NO2S/c19-18(20,21)12-5-3-4-11(8-12)13-10-25-17(22-13)16-9-23-14-6-1-2-7-15(14)24-16/h1-8,10,16H,9H2
NCI pathway
Reactome pathway
4.30E+3 -7.24n/an/an/an/an/a7.522
Burnham Institute
Assay Description
Fluorescent assays were carried out in black 96-well plates. Caspase activity was monitored using a Labsystem Fluoroskan II spectrofluorometer with a...
J Med Chem 48: 1649-56 (2005)
Article DOI: 10.1021/jm0493212
BindingDB Entry DOI: 10.7270/Q2GT5KDJ
Caspase-7
(Homo sapiens (Human))
BDBM10215
(2-(2,3-dihydro-1,4-benzodioxin-2-yl)-4-[3-(trifluo...)
Show SMILES FC(F)(F)c1cccc(c1)-c1csc(n1)C1COc2ccccc2O1
Show InChI InChI=1S/C18H12F3NO2S/c19-18(20,21)12-5-3-4-11(8-12)13-10-25-17(22-13)16-9-23-14-6-1-2-7-15(14)24-16/h1-8,10,16H,9H2
NCI pathway
Reactome pathway
6.20E+3n/an/an/an/an/an/an/an/a
Burnham Institute
Assay Description
Fluorescent assays were carried out in black 96-well plates. Caspase activity was monitored using a Labsystem Fluoroskan II spectrofluorometer with a...
J Med Chem 48: 1649-56 (2005)
Article DOI: 10.1021/jm0493212
BindingDB Entry DOI: 10.7270/Q2GT5KDJ