BDBM102845 US8541572, 927
SMILES: COc1ccc2CN(C[C@]3(NC(=O)NC3=O)C#Cc3ccc(cc3)C(N=O)N3CCN(CC3)C3CCCCCC3)C(=O)c2c1
InChI Key: InChIKey=LKAXKNIZWUKZSQ-FYEOKJGGSA-N
Data: 1 KI  1 IC50
Activity Spreadsheet -- Enzyme Inhibition Constant Data from BindingDB
Found 1 hit for monomerid = 102845
Trg + Lig
Ki
nM
ΔG°
kcal/mole
IC50
nM
Kd
nM
EC50/IC50
nM
koff
s-1
kon
M-1s-1
pHTemp
°C
Tumor necrosis factor
(Homo sapiens (Human))
BDBM102845
(US8541572, 927)
Show SMILES COc1ccc2CN(C[C@]3(NC(=O)NC3=O)C#Cc3ccc(cc3)C(N=O)N3CCN(CC3)C3CCCCCC3)C(=O)c2c1 |r|
Show InChI InChI=1S/C33H38N6O5/c1-44-27-13-12-25-21-39(30(40)28(25)20-27)22-33(31(41)34-32(42)35-33)15-14-23-8-10-24(11-9-23)29(36-43)38-18-16-37(17-19-38)26-6-4-2-3-5-7-26/h8-13,20,26,29H,2-7,16-19,21-22H2,1H3,(H2,34,35,41,42)/t29?,33-/m1/s1
Reactome pathway
US Patent
0.0630n/a 151n/an/an/an/an/an/a
Merck Sharp & Dohme Corp.
US Patent
Assay Description
Inhibition assay using TNF-alpha.
US Patent US8541572 (2013)
BindingDB Entry DOI: 10.7270/Q2QC024J