BDBM103338 US8546392, 59
SMILES: OC(=O)CCC(=O)Nc1ccc(cc1)-c1c(O)ccc2cc(ccc12)-c1cccc(O)c1
InChI Key: InChIKey=ZTMKPXUZAMIYCW-UHFFFAOYSA-N
Data: 8 IC50
Activity Spreadsheet -- Enzyme Inhibition Constant Data from BindingDB
Found 8 hits for monomerid = 103338
Trg + Lig
Ki
nM
ΔG°
kcal/mole
IC50
nM
Kd
nM
EC50/IC50
nM
koff
s-1
kon
M-1s-1
pHTemp
°C
Estradiol 17-beta-dehydrogenase 1 (17beta-HSD1)
(Homo sapiens (Human))
BDBM103338
(US8546392, 59)
Show SMILES OC(=O)CCC(=O)Nc1ccc(cc1)-c1c(O)ccc2cc(ccc12)-c1cccc(O)c1
Show InChI InChI=1S/C26H21NO5/c28-21-3-1-2-17(15-21)18-6-10-22-19(14-18)7-11-23(29)26(22)16-4-8-20(9-5-16)27-24(30)12-13-25(31)32/h1-11,14-15,28-29H,12-13H2,(H,27,30)(H,31,32)
Reactome pathway
US Patent
n/an/a 20n/an/an/an/an/an/a
Universitaet des Saarlandes
US Patent
Assay Description
The determination of IC50 values was performed with enzyme isolated from human placenta (Luu-The, V. et al., J. Steroid Biochem. Mol. Biol., 55:581-5...
US Patent US8546392 (2013)
BindingDB Entry DOI: 10.7270/Q2WW7G8P
Estradiol 17-beta-dehydrogenase 2
(Homo sapiens (Human))
BDBM103338
(US8546392, 59)
Show SMILES OC(=O)CCC(=O)Nc1ccc(cc1)-c1c(O)ccc2cc(ccc12)-c1cccc(O)c1
Show InChI InChI=1S/C26H21NO5/c28-21-3-1-2-17(15-21)18-6-10-22-19(14-18)7-11-23(29)26(22)16-4-8-20(9-5-16)27-24(30)12-13-25(31)32/h1-11,14-15,28-29H,12-13H2,(H,27,30)(H,31,32)
US Patent
n/an/a 1.16E+3n/an/an/an/an/an/a
Universitaet des Saarlandes
US Patent
Assay Description
The determination of IC50 values was performed with enzyme isolated from human placenta (Luu-The, V. et al., J. Steroid Biochem. Mol. Biol., 55:581-5...
US Patent US8546392 (2013)
BindingDB Entry DOI: 10.7270/Q2WW7G8P
Cytochrome P450 1A
(Homo sapiens (Human))
BDBM103338
(US8546392, 59)
Show SMILES OC(=O)CCC(=O)Nc1ccc(cc1)-c1c(O)ccc2cc(ccc12)-c1cccc(O)c1
Show InChI InChI=1S/C26H21NO5/c28-21-3-1-2-17(15-21)18-6-10-22-19(14-18)7-11-23(29)26(22)16-4-8-20(9-5-16)27-24(30)12-13-25(31)32/h1-11,14-15,28-29H,12-13H2,(H,27,30)(H,31,32)
Reactome pathway
US Patent
n/an/a 14n/an/an/an/an/an/a
Universitaet des Saarlandes
US Patent
Assay Description
Inhibition assay using P450 CYP enzymes.
US Patent US8546392 (2013)
BindingDB Entry DOI: 10.7270/Q2WW7G8P
Cytochrome P450 3A4
(Homo sapiens (Human))
BDBM103338
(US8546392, 59)
Show SMILES OC(=O)CCC(=O)Nc1ccc(cc1)-c1c(O)ccc2cc(ccc12)-c1cccc(O)c1
Show InChI InChI=1S/C26H21NO5/c28-21-3-1-2-17(15-21)18-6-10-22-19(14-18)7-11-23(29)26(22)16-4-8-20(9-5-16)27-24(30)12-13-25(31)32/h1-11,14-15,28-29H,12-13H2,(H,27,30)(H,31,32)
Reactome pathway
US Patent
n/an/a 221n/an/an/an/an/an/a
Universitaet des Saarlandes
US Patent
Assay Description
Inhibition assay using P450 CYP enzymes.
US Patent US8546392 (2013)
BindingDB Entry DOI: 10.7270/Q2WW7G8P
Cytochrome P450 2C9
(Homo sapiens (Human))
BDBM103338
(US8546392, 59)
Show SMILES OC(=O)CCC(=O)Nc1ccc(cc1)-c1c(O)ccc2cc(ccc12)-c1cccc(O)c1
Show InChI InChI=1S/C26H21NO5/c28-21-3-1-2-17(15-21)18-6-10-22-19(14-18)7-11-23(29)26(22)16-4-8-20(9-5-16)27-24(30)12-13-25(31)32/h1-11,14-15,28-29H,12-13H2,(H,27,30)(H,31,32)
Reactome pathway
US Patent
n/an/a 150n/an/an/an/an/an/a
Universitaet des Saarlandes
US Patent
Assay Description
Inhibition assay using P450 CYP enzymes.
US Patent US8546392 (2013)
BindingDB Entry DOI: 10.7270/Q2WW7G8P
Cytochrome P450 2C19
(Homo sapiens (Human))
BDBM103338
(US8546392, 59)
Show SMILES OC(=O)CCC(=O)Nc1ccc(cc1)-c1c(O)ccc2cc(ccc12)-c1cccc(O)c1
Show InChI InChI=1S/C26H21NO5/c28-21-3-1-2-17(15-21)18-6-10-22-19(14-18)7-11-23(29)26(22)16-4-8-20(9-5-16)27-24(30)12-13-25(31)32/h1-11,14-15,28-29H,12-13H2,(H,27,30)(H,31,32)
Reactome pathway
US Patent
n/an/a 880n/an/an/an/an/an/a
Universitaet des Saarlandes
US Patent
Assay Description
Inhibition assay using P450 CYP enzymes.
US Patent US8546392 (2013)
BindingDB Entry DOI: 10.7270/Q2WW7G8P
Cytochrome P450 2D6
(Homo sapiens (Human))
BDBM103338
(US8546392, 59)
Show SMILES OC(=O)CCC(=O)Nc1ccc(cc1)-c1c(O)ccc2cc(ccc12)-c1cccc(O)c1
Show InChI InChI=1S/C26H21NO5/c28-21-3-1-2-17(15-21)18-6-10-22-19(14-18)7-11-23(29)26(22)16-4-8-20(9-5-16)27-24(30)12-13-25(31)32/h1-11,14-15,28-29H,12-13H2,(H,27,30)(H,31,32)
US Patent
n/an/a 2.29E+4n/an/an/an/an/an/a
Universitaet des Saarlandes
US Patent
Assay Description
Inhibition assay using P450 CYP enzymes.
US Patent US8546392 (2013)
BindingDB Entry DOI: 10.7270/Q2WW7G8P
Cytochrome P450 1A
(Homo sapiens (Human))
BDBM103338
(US8546392, 59)
Show SMILES OC(=O)CCC(=O)Nc1ccc(cc1)-c1c(O)ccc2cc(ccc12)-c1cccc(O)c1
Show InChI InChI=1S/C26H21NO5/c28-21-3-1-2-17(15-21)18-6-10-22-19(14-18)7-11-23(29)26(22)16-4-8-20(9-5-16)27-24(30)12-13-25(31)32/h1-11,14-15,28-29H,12-13H2,(H,27,30)(H,31,32)
Reactome pathway
US Patent
n/an/a 5.34E+3n/an/an/an/an/an/a
Universitaet des Saarlandes
US Patent
Assay Description
Inhibition assay using P450 CYP enzymes.
US Patent US8546392 (2013)
BindingDB Entry DOI: 10.7270/Q2WW7G8P