BDBM103346 US8546392, 70
SMILES: CNC(=O)\C=C\c1cc(OC)cc(c1)-c1ccc2cc(OC)ccc2c1
InChI Key: InChIKey=VIZKFHFQFJRUES-RUDMXATFSA-N
Data: 8 IC50
Activity Spreadsheet -- Enzyme Inhibition Constant Data from BindingDB
Found 8 hits for monomerid = 103346
Trg + Lig
Ki
nM
ΔG°
kcal/mole
IC50
nM
Kd
nM
EC50/IC50
nM
koff
s-1
kon
M-1s-1
pHTemp
°C
17-beta-hydroxysteroid dehydrogenase type 1
(Homo sapiens (Human))
BDBM103346
(US8546392, 70)
Show SMILES CNC(=O)\C=C\c1cc(OC)cc(c1)-c1ccc2cc(OC)ccc2c1
Show InChI InChI=1S/C22H21NO3/c1-23-22(24)9-4-15-10-19(14-21(11-15)26-3)17-5-6-18-13-20(25-2)8-7-16(18)12-17/h4-14H,1-3H3,(H,23,24)/b9-4+
Reactome pathway
US Patent
n/an/a 30n/an/an/an/an/an/a
Universitaet des Saarlandes
US Patent
Assay Description
The determination of IC50 values was performed with enzyme isolated from human placenta (Luu-The, V. et al., J. Steroid Biochem. Mol. Biol., 55:581-5...
US Patent US8546392 (2013)
BindingDB Entry DOI: 10.7270/Q2WW7G8P
17-beta-hydroxysteroid dehydrogenase type 2
(Homo sapiens (Human))
BDBM103346
(US8546392, 70)
Show SMILES CNC(=O)\C=C\c1cc(OC)cc(c1)-c1ccc2cc(OC)ccc2c1
Show InChI InChI=1S/C22H21NO3/c1-23-22(24)9-4-15-10-19(14-21(11-15)26-3)17-5-6-18-13-20(25-2)8-7-16(18)12-17/h4-14H,1-3H3,(H,23,24)/b9-4+
US Patent
n/an/a 195n/an/an/an/an/an/a
Universitaet des Saarlandes
US Patent
Assay Description
The determination of IC50 values was performed with enzyme isolated from human placenta (Luu-The, V. et al., J. Steroid Biochem. Mol. Biol., 55:581-5...
US Patent US8546392 (2013)
BindingDB Entry DOI: 10.7270/Q2WW7G8P
Cytochrome P450 1A2
(Homo sapiens (Human))
BDBM103346
(US8546392, 70)
Show SMILES CNC(=O)\C=C\c1cc(OC)cc(c1)-c1ccc2cc(OC)ccc2c1
Show InChI InChI=1S/C22H21NO3/c1-23-22(24)9-4-15-10-19(14-21(11-15)26-3)17-5-6-18-13-20(25-2)8-7-16(18)12-17/h4-14H,1-3H3,(H,23,24)/b9-4+
Reactome pathway
US Patent
n/an/a 3.75E+4n/an/an/an/an/an/a
Universitaet des Saarlandes
US Patent
Assay Description
Inhibition assay using P450 CYP enzymes.
US Patent US8546392 (2013)
BindingDB Entry DOI: 10.7270/Q2WW7G8P
Cytochrome P450 3A4
(Homo sapiens (Human))
BDBM103346
(US8546392, 70)
Show SMILES CNC(=O)\C=C\c1cc(OC)cc(c1)-c1ccc2cc(OC)ccc2c1
Show InChI InChI=1S/C22H21NO3/c1-23-22(24)9-4-15-10-19(14-21(11-15)26-3)17-5-6-18-13-20(25-2)8-7-16(18)12-17/h4-14H,1-3H3,(H,23,24)/b9-4+
Reactome pathway
US Patent
n/an/a 2.25E+3n/an/an/an/an/an/a
Universitaet des Saarlandes
US Patent
Assay Description
Inhibition assay using P450 CYP enzymes.
US Patent US8546392 (2013)
BindingDB Entry DOI: 10.7270/Q2WW7G8P
Cytochrome P450 2C9
(Homo sapiens (Human))
BDBM103346
(US8546392, 70)
Show SMILES CNC(=O)\C=C\c1cc(OC)cc(c1)-c1ccc2cc(OC)ccc2c1
Show InChI InChI=1S/C22H21NO3/c1-23-22(24)9-4-15-10-19(14-21(11-15)26-3)17-5-6-18-13-20(25-2)8-7-16(18)12-17/h4-14H,1-3H3,(H,23,24)/b9-4+
Reactome pathway
US Patent
n/an/a 30n/an/an/an/an/an/a
Universitaet des Saarlandes
US Patent
Assay Description
Inhibition assay using P450 CYP enzymes.
US Patent US8546392 (2013)
BindingDB Entry DOI: 10.7270/Q2WW7G8P
Cytochrome P450 2C19
(Homo sapiens (Human))
BDBM103346
(US8546392, 70)
Show SMILES CNC(=O)\C=C\c1cc(OC)cc(c1)-c1ccc2cc(OC)ccc2c1
Show InChI InChI=1S/C22H21NO3/c1-23-22(24)9-4-15-10-19(14-21(11-15)26-3)17-5-6-18-13-20(25-2)8-7-16(18)12-17/h4-14H,1-3H3,(H,23,24)/b9-4+
Reactome pathway
US Patent
n/an/a 8.83E+3n/an/an/an/an/an/a
Universitaet des Saarlandes
US Patent
Assay Description
Inhibition assay using P450 CYP enzymes.
US Patent US8546392 (2013)
BindingDB Entry DOI: 10.7270/Q2WW7G8P
Cytochrome P450 2D6
(Homo sapiens (Human))
BDBM103346
(US8546392, 70)
Show SMILES CNC(=O)\C=C\c1cc(OC)cc(c1)-c1ccc2cc(OC)ccc2c1
Show InChI InChI=1S/C22H21NO3/c1-23-22(24)9-4-15-10-19(14-21(11-15)26-3)17-5-6-18-13-20(25-2)8-7-16(18)12-17/h4-14H,1-3H3,(H,23,24)/b9-4+
US Patent
n/an/a 3.94E+4n/an/an/an/an/an/a
Universitaet des Saarlandes
US Patent
Assay Description
Inhibition assay using P450 CYP enzymes.
US Patent US8546392 (2013)
BindingDB Entry DOI: 10.7270/Q2WW7G8P
Cytochrome P450 1A2
(Homo sapiens (Human))
BDBM103346
(US8546392, 70)
Show SMILES CNC(=O)\C=C\c1cc(OC)cc(c1)-c1ccc2cc(OC)ccc2c1
Show InChI InChI=1S/C22H21NO3/c1-23-22(24)9-4-15-10-19(14-21(11-15)26-3)17-5-6-18-13-20(25-2)8-7-16(18)12-17/h4-14H,1-3H3,(H,23,24)/b9-4+
Reactome pathway
US Patent
n/an/a 1.36E+4n/an/an/an/an/an/a
Universitaet des Saarlandes
US Patent
Assay Description
Inhibition assay using P450 CYP enzymes.
US Patent US8546392 (2013)
BindingDB Entry DOI: 10.7270/Q2WW7G8P