BDBM107039 US8592432, 14
SMILES: CC(C)Oc1cc2CN(C3CCN(CC3)C(=O)C3CCCN3C)C(=O)c2cc1Nc1ncc(Cl)c(Nc2ccccc2S(=O)(=O)C(C)C)n1
InChI Key: InChIKey=OXHQSLVSULVZQB-UHFFFAOYSA-N
Data: 1 IC50
Activity Spreadsheet -- Enzyme Inhibition Constant Data from BindingDB
Found 1 hit for monomerid = 107039
Trg + Lig
Ki
nM
ΔG°
kcal/mole
IC50
nM
Kd
nM
EC50/IC50
nM
koff
s-1
kon
M-1s-1
pHTemp
°C
ALK tyrosine kinase receptor
(Homo sapiens (Human))
BDBM107039
(US8592432, 14)
Show SMILES CC(C)Oc1cc2CN(C3CCN(CC3)C(=O)C3CCCN3C)C(=O)c2cc1Nc1ncc(Cl)c(Nc2ccccc2S(=O)(=O)C(C)C)n1
Show InChI InChI=1S/C35H44ClN7O5S/c1-21(2)48-30-17-23-20-43(24-12-15-42(16-13-24)34(45)29-10-8-14-41(29)5)33(44)25(23)18-28(30)39-35-37-19-26(36)32(40-35)38-27-9-6-7-11-31(27)49(46,47)22(3)4/h6-7,9,11,17-19,21-22,24,29H,8,10,12-16,20H2,1-5H3,(H2,37,38,39,40)
US Patent
n/an/a 5n/an/an/an/an/an/a
TBA
US Patent
Assay Description
The inhibition of ALK tyrosine kinase activity may be demonstrated using known methods, for example using the recombinant kinase domain of the ALK in...
US Patent US8592432 (2013)
BindingDB Entry DOI: 10.7270/Q2J67FK9