BDBM10846 4-(1H-indol-2-yl)pyrimidin-2-amine::isomeridianin G
SMILES: Nc1nccc(n1)-c1cc2ccccc2[nH]1
InChI Key: InChIKey=DMIMDIGPBYDVRA-UHFFFAOYSA-N
Data: 6 IC50
Activity Spreadsheet -- Enzyme Inhibition Constant Data from BindingDB
Found 6 hits for monomerid = 10846
Trg + Lig
Ki
nM
ΔG°
kcal/mole
IC50
nM
Kd
nM
EC50/IC50
nM
koff
s-1
kon
M-1s-1
pHTemp
°C
Cyclin-Dependent Kinase 1 (CDK1)
(Homo sapiens (Human))
BDBM10846
(4-(1H-indol-2-yl)pyrimidin-2-amine | isomeridianin...)
Show SMILES Nc1nccc(n1)-c1cc2ccccc2[nH]1
Show InChI InChI=1S/C12H10N4/c13-12-14-6-5-10(16-12)11-7-8-3-1-2-4-9(8)15-11/h1-7,15H,(H2,13,14,16)
Reactome pathway
n/an/a 1.40E+5n/an/an/an/a7.230
CNRS
Assay Description
Kinase activities were assayed in buffers containing substrate, enzyme, and inhibitor at 30°C in the presence of 15 uM ATP/[gamma-32P] ATP. 32P ...
Bioorg Med Chem Lett 14: 1703-7 (2004)
Article DOI: 10.1016/j.bmcl.2004.01.050
BindingDB Entry DOI: 10.7270/Q2BZ648W
Cyclin-Dependent Kinase 5 (CDK5)
(Homo sapiens (Human))
BDBM10846
(4-(1H-indol-2-yl)pyrimidin-2-amine | isomeridianin...)
Show SMILES Nc1nccc(n1)-c1cc2ccccc2[nH]1
Show InChI InChI=1S/C12H10N4/c13-12-14-6-5-10(16-12)11-7-8-3-1-2-4-9(8)15-11/h1-7,15H,(H2,13,14,16)
NCI pathway
Reactome pathway
n/an/a 1.30E+5n/an/an/an/an/a30
CNRS
Assay Description
Kinase activities were assayed in buffers containing substrate, enzyme, and inhibitor at 30°C in the presence of 15 uM ATP/[gamma-32P] ATP. 32P ...
Bioorg Med Chem Lett 14: 1703-7 (2004)
Article DOI: 10.1016/j.bmcl.2004.01.050
BindingDB Entry DOI: 10.7270/Q2BZ648W
Glycogen synthase kinase-3 beta
(Homo sapiens (Human))
BDBM10846
(4-(1H-indol-2-yl)pyrimidin-2-amine | isomeridianin...)
Show SMILES Nc1nccc(n1)-c1cc2ccccc2[nH]1
Show InChI InChI=1S/C12H10N4/c13-12-14-6-5-10(16-12)11-7-8-3-1-2-4-9(8)15-11/h1-7,15H,(H2,13,14,16)
NCI pathway
Reactome pathway
n/an/a 4.20E+5n/an/an/an/an/an/a
Sterling Road
Curated by ChEMBL
Assay Description
Inhibition of human GSK3beta
Eur J Med Chem 44: 2361-71 (2009)
Article DOI: 10.1016/j.ejmech.2008.08.012
BindingDB Entry DOI: 10.7270/Q2057FZX
cGMP-Dependent Protein Kinase
(Bos taurus (bovine))
BDBM10846
(4-(1H-indol-2-yl)pyrimidin-2-amine | isomeridianin...)
Show SMILES Nc1nccc(n1)-c1cc2ccccc2[nH]1
Show InChI InChI=1S/C12H10N4/c13-12-14-6-5-10(16-12)11-7-8-3-1-2-4-9(8)15-11/h1-7,15H,(H2,13,14,16)
Reactome pathway
n/an/a 1.00E+6n/an/an/an/an/a30
CNRS
Assay Description
Kinase activities were assayed in buffers containing substrate, enzyme, and inhibitor at 30°C in the presence of 15 uM ATP/[gamma-32P] ATP. 32P ...
Bioorg Med Chem Lett 14: 1703-7 (2004)
Article DOI: 10.1016/j.bmcl.2004.01.050
BindingDB Entry DOI: 10.7270/Q2BZ648W
Glycogen Synthase Kinase-3, beta
(Rattus norvegicus (rat))
BDBM10846
(4-(1H-indol-2-yl)pyrimidin-2-amine | isomeridianin...)
Show SMILES Nc1nccc(n1)-c1cc2ccccc2[nH]1
Show InChI InChI=1S/C12H10N4/c13-12-14-6-5-10(16-12)11-7-8-3-1-2-4-9(8)15-11/h1-7,15H,(H2,13,14,16)
Reactome pathway
n/an/a 4.20E+5n/an/an/an/an/a30
CNRS
Assay Description
Kinase activities were assayed in buffers containing substrate, enzyme, and inhibitor at 30°C in the presence of 15 uM ATP/[gamma-32P] ATP. 32P ...
Bioorg Med Chem Lett 14: 1703-7 (2004)
Article DOI: 10.1016/j.bmcl.2004.01.050
BindingDB Entry DOI: 10.7270/Q2BZ648W
cAMP-Dependent Protein Kinase (PKA)
(Bos taurus (bovine))
BDBM10846
(4-(1H-indol-2-yl)pyrimidin-2-amine | isomeridianin...)
Show SMILES Nc1nccc(n1)-c1cc2ccccc2[nH]1
Show InChI InChI=1S/C12H10N4/c13-12-14-6-5-10(16-12)11-7-8-3-1-2-4-9(8)15-11/h1-7,15H,(H2,13,14,16)
n/an/a 5.00E+5n/an/an/an/an/a30
CNRS
Assay Description
Kinase activities were assayed in buffers containing substrate, enzyme, and inhibitor at 30°C in the presence of 15 uM ATP/[gamma-32P] ATP. 32P ...
Bioorg Med Chem Lett 14: 1703-7 (2004)
Article DOI: 10.1016/j.bmcl.2004.01.050
BindingDB Entry DOI: 10.7270/Q2BZ648W