BDBM108903 US8604016, 484::US9938267, Cmpd ID 484
SMILES: CCCN(C)C(=O)Cc1cccc(CC(=O)Nc2nnc(CCCCc3ccc(NC(=O)Cc4ccccc4)nn3)s2)c1
InChI Key: InChIKey=FZISIHOFBCWMHR-UHFFFAOYSA-N
Data: 2 IC50
Activity Spreadsheet -- Enzyme Inhibition Constant Data from BindingDB
Found 2 hits for monomerid = 108903
Trg + Lig
Ki
nM
ΔG°
kcal/mole
IC50
nM
Kd
nM
EC50/IC50
nM
koff
s-1
kon
M-1s-1
pHTemp
°C
Glutaminase kidney isoform, mitochondrial
(Homo sapiens (Human))
BDBM108903
(US8604016, 484 | US9938267, Cmpd ID 484)
Show SMILES CCCN(C)C(=O)Cc1cccc(CC(=O)Nc2nnc(CCCCc3ccc(NC(=O)Cc4ccccc4)nn3)s2)c1
Show InChI InChI=1S/C32H37N7O3S/c1-3-18-39(2)31(42)22-25-13-9-12-24(19-25)21-29(41)34-32-38-37-30(43-32)15-8-7-14-26-16-17-27(36-35-26)33-28(40)20-23-10-5-4-6-11-23/h4-6,9-13,16-17,19H,3,7-8,14-15,18,20-22H2,1-2H3,(H,33,36,40)(H,34,38,41)
US Patent
n/an/a 3n/an/an/an/an/an/a
Amgen
Assay Description
Compounds were assessed for their ability to inhibit the enzymatic activity of a recombinant form of Glutaminase 1 (GAC) using a biochemical assay th...
J Med Chem 51: 1681-94 (2008)
BindingDB Entry DOI: 10.7270/Q2JS9SQV
Glutaminase kidney isoform, mitochondrial
(Homo sapiens (Human))
BDBM108903
(US8604016, 484 | US9938267, Cmpd ID 484)
Show SMILES CCCN(C)C(=O)Cc1cccc(CC(=O)Nc2nnc(CCCCc3ccc(NC(=O)Cc4ccccc4)nn3)s2)c1
Show InChI InChI=1S/C32H37N7O3S/c1-3-18-39(2)31(42)22-25-13-9-12-24(19-25)21-29(41)34-32-38-37-30(43-32)15-8-7-14-26-16-17-27(36-35-26)33-28(40)20-23-10-5-4-6-11-23/h4-6,9-13,16-17,19H,3,7-8,14-15,18,20-22H2,1-2H3,(H,33,36,40)(H,34,38,41)
US Patent
n/an/a 3n/an/an/an/an/an/a
Calithera Biosciences Inc.
US Patent
Assay Description
Compounds were assessed for their ability to inhibit the enzymatic activity of a recombinant form of Glutaminase 1 (GAC) using a biochemical assay th...
US Patent US8604016 (2013)
BindingDB Entry DOI: 10.7270/Q2CC0ZBW