BDBM108978 US8604016, 560::US9938267, Cmpd ID 560
SMILES: CC(N)c1cccc(CC(=O)Nc2ccc(CCCCc3nnc(NC(=O)Cc4ccccc4)s3)nn2)c1
InChI Key: InChIKey=SRWPVSCNHXITQP-UHFFFAOYSA-N
Data: 2 IC50
Activity Spreadsheet -- Enzyme Inhibition Constant Data from BindingDB
Found 2 hits for monomerid = 108978
Trg + Lig
Ki
nM
ΔG°
kcal/mole
IC50
nM
Kd
nM
EC50/IC50
nM
koff
s-1
kon
M-1s-1
pHTemp
°C
Glutaminase kidney isoform, mitochondrial
(Homo sapiens (Human))
BDBM108978
(US8604016, 560 | US9938267, Cmpd ID 560)
Show SMILES CC(N)c1cccc(CC(=O)Nc2ccc(CCCCc3nnc(NC(=O)Cc4ccccc4)s3)nn2)c1
Show InChI InChI=1S/C28H31N7O2S/c1-19(29)22-11-7-10-21(16-22)18-25(36)30-24-15-14-23(32-33-24)12-5-6-13-27-34-35-28(38-27)31-26(37)17-20-8-3-2-4-9-20/h2-4,7-11,14-16,19H,5-6,12-13,17-18,29H2,1H3,(H,30,33,36)(H,31,35,37)
US Patent
n/an/a 10n/an/an/an/an/an/a
Amgen
Assay Description
Compounds were assessed for their ability to inhibit the enzymatic activity of a recombinant form of Glutaminase 1 (GAC) using a biochemical assay th...
J Med Chem 51: 1681-94 (2008)
BindingDB Entry DOI: 10.7270/Q2JS9SQV
Glutaminase kidney isoform, mitochondrial
(Homo sapiens (Human))
BDBM108978
(US8604016, 560 | US9938267, Cmpd ID 560)
Show SMILES CC(N)c1cccc(CC(=O)Nc2ccc(CCCCc3nnc(NC(=O)Cc4ccccc4)s3)nn2)c1
Show InChI InChI=1S/C28H31N7O2S/c1-19(29)22-11-7-10-21(16-22)18-25(36)30-24-15-14-23(32-33-24)12-5-6-13-27-34-35-28(38-27)31-26(37)17-20-8-3-2-4-9-20/h2-4,7-11,14-16,19H,5-6,12-13,17-18,29H2,1H3,(H,30,33,36)(H,31,35,37)
US Patent
n/an/a 10n/an/an/an/an/an/a
Calithera Biosciences Inc.
US Patent
Assay Description
Compounds were assessed for their ability to inhibit the enzymatic activity of a recombinant form of Glutaminase 1 (GAC) using a biochemical assay th...
US Patent US8604016 (2013)
BindingDB Entry DOI: 10.7270/Q2CC0ZBW