BDBM109753 US8609708, 29::US8609708, 38
SMILES: NCC1CCC(O1)c1cccnc1
InChI Key: InChIKey=BZSFZSCNTDEVRV-UHFFFAOYSA-N
Data: 8 IC50
Activity Spreadsheet -- Enzyme Inhibition Constant Data from BindingDB
Found 8 hits for monomerid = 109753
Trg + Lig
Ki
nM
ΔG°
kcal/mole
IC50
nM
Kd
nM
EC50/IC50
nM
koff
s-1
kon
M-1s-1
pHTemp
°C
Cytochrome P450 2A6
(Homo sapiens (Human))
BDBM109753
(US8609708, 29 | US8609708, 38)
Show SMILES NCC1CCC(O1)c1cccnc1
Show InChI InChI=1S/C10H14N2O/c11-6-9-3-4-10(13-9)8-2-1-5-12-7-8/h1-2,5,7,9-10H,3-4,6,11H2
Reactome pathway
US Patent
n/an/a 5.90E+3n/an/an/an/an/an/a
Human BioMolecular Research Institute
US Patent
Assay Description
The inhibition of human CYP2A6-mediated 7-hydroxy coumarin formation was evaluated in the presence of 95 selected test compounds in a standard assay ...
US Patent US8609708 (2013)
BindingDB Entry DOI: 10.7270/Q2PN9481
Cytochrome P450 2A6
(Homo sapiens (Human))
BDBM109753
(US8609708, 29 | US8609708, 38)
Show SMILES NCC1CCC(O1)c1cccnc1
Show InChI InChI=1S/C10H14N2O/c11-6-9-3-4-10(13-9)8-2-1-5-12-7-8/h1-2,5,7,9-10H,3-4,6,11H2
Reactome pathway
US Patent
n/an/a 9.42E+3n/an/an/an/an/an/a
Human BioMolecular Research Institute
US Patent
Assay Description
The inhibition of human CYP2A6-mediated 7-hydroxy coumarin formation was evaluated in the presence of 95 selected test compounds in a standard assay ...
US Patent US8609708 (2013)
BindingDB Entry DOI: 10.7270/Q2PN9481
Cytochrome P450 2A6
(Homo sapiens (Human))
BDBM109753
(US8609708, 29 | US8609708, 38)
Show SMILES NCC1CCC(O1)c1cccnc1
Show InChI InChI=1S/C10H14N2O/c11-6-9-3-4-10(13-9)8-2-1-5-12-7-8/h1-2,5,7,9-10H,3-4,6,11H2
Reactome pathway
US Patent
n/an/a 330n/an/an/an/an/an/a
Human BioMolecular Research Institute
US Patent
Assay Description
The inhibition of human CYP2A6-mediated 7-hydroxy coumarin formation was evaluated in the presence of 95 selected test compounds in a standard assay ...
US Patent US8609708 (2013)
BindingDB Entry DOI: 10.7270/Q2PN9481
Cytochrome P450 3A4
(Homo sapiens (Human))
BDBM109753
(US8609708, 29 | US8609708, 38)
Show SMILES NCC1CCC(O1)c1cccnc1
Show InChI InChI=1S/C10H14N2O/c11-6-9-3-4-10(13-9)8-2-1-5-12-7-8/h1-2,5,7,9-10H,3-4,6,11H2
Reactome pathway
US Patent
n/an/a 6.47E+4n/an/an/an/an/an/a
Human BioMolecular Research Institute
US Patent
Assay Description
To gain insight into the selectivity of the synthetic compounds, nicotine, nicotine related alkaloids and nicotine metabolites for inhibition of othe...
US Patent US8609708 (2013)
BindingDB Entry DOI: 10.7270/Q2PN9481
Cytochrome P450 2A6
(Homo sapiens (Human))
BDBM109753
(US8609708, 29 | US8609708, 38)
Show SMILES NCC1CCC(O1)c1cccnc1
Show InChI InChI=1S/C10H14N2O/c11-6-9-3-4-10(13-9)8-2-1-5-12-7-8/h1-2,5,7,9-10H,3-4,6,11H2
Reactome pathway
US Patent
n/an/a 1.02E+3n/an/an/an/an/an/a
Human BioMolecular Research Institute
US Patent
Assay Description
The inhibition of human CYP2A6-mediated 7-hydroxy coumarin formation was evaluated in the presence of 95 selected test compounds in a standard assay ...
US Patent US8609708 (2013)
BindingDB Entry DOI: 10.7270/Q2PN9481
Cytochrome P450 2A6
(Homo sapiens (Human))
BDBM109753
(US8609708, 29 | US8609708, 38)
Show SMILES NCC1CCC(O1)c1cccnc1
Show InChI InChI=1S/C10H14N2O/c11-6-9-3-4-10(13-9)8-2-1-5-12-7-8/h1-2,5,7,9-10H,3-4,6,11H2
Reactome pathway
US Patent
n/an/a 5.90E+3n/an/an/an/an/an/a
Human BioMolecular Research Institute
US Patent
Assay Description
The inhibition of human CYP2A6-mediated 7-hydroxy coumarin formation was evaluated in the presence of 95 selected test compounds in a standard assay ...
US Patent US8609708 (2013)
BindingDB Entry DOI: 10.7270/Q2PN9481
Cytochrome P450 2A6
(Homo sapiens (Human))
BDBM109753
(US8609708, 29 | US8609708, 38)
Show SMILES NCC1CCC(O1)c1cccnc1
Show InChI InChI=1S/C10H14N2O/c11-6-9-3-4-10(13-9)8-2-1-5-12-7-8/h1-2,5,7,9-10H,3-4,6,11H2
Reactome pathway
US Patent
n/an/a 9.42E+3n/an/an/an/an/an/a
Human BioMolecular Research Institute
US Patent
Assay Description
The inhibition of human CYP2A6-mediated 7-hydroxy coumarin formation was evaluated in the presence of 95 selected test compounds in a standard assay ...
US Patent US8609708 (2013)
BindingDB Entry DOI: 10.7270/Q2PN9481
Cytochrome P450 2A6
(Homo sapiens (Human))
BDBM109753
(US8609708, 29 | US8609708, 38)
Show SMILES NCC1CCC(O1)c1cccnc1
Show InChI InChI=1S/C10H14N2O/c11-6-9-3-4-10(13-9)8-2-1-5-12-7-8/h1-2,5,7,9-10H,3-4,6,11H2
Reactome pathway
US Patent
n/an/a 5.21E+3n/an/an/an/an/an/a
Human BioMolecular Research Institute
US Patent
Assay Description
The inhibition of human CYP2A6-mediated 7-hydroxy coumarin formation was evaluated in the presence of 95 selected test compounds in a standard assay ...
US Patent US8609708 (2013)
BindingDB Entry DOI: 10.7270/Q2PN9481