BDBM110990 US8614253, 3-21::US9241942, 3-21::US9963434, Compound 3-21
SMILES: Oc1c(C=O)cc(Cl)cc1C=O
InChI Key: InChIKey=MYHXSDYZVOKOAT-UHFFFAOYSA-N
Data: 3 IC50
Activity Spreadsheet -- Enzyme Inhibition Constant Data from BindingDB
Found 3 hits for monomerid = 110990
Trg + Lig
Ki
nM
ΔG°
kcal/mole
IC50
nM
Kd
nM
EC50/IC50
nM
koff
s-1
kon
M-1s-1
pHTemp
°C
Serine/threonine-protein kinase/endoribonuclease IRE1 Alpha
(Homo sapiens (Human))
BDBM110990
(US8614253, 3-21 | US9241942, 3-21 | US9963434, Com...)
Show SMILES Oc1c(C=O)cc(Cl)cc1C=O
Show InChI InChI=1S/C8H5ClO3/c9-7-1-5(3-10)8(12)6(2-7)4-11/h1-4,12H
Reactome pathway
US Patent
n/an/a 400n/an/an/an/a7.530
MannKind Corporation
US Patent
Assay Description
IRE-1 alpha, T1 RNase, and RNase A assays carried out in vitro with several o-vanillin derivatives to demonstrate selectivity of the derivatives for ...
US Patent US8614253 (2013)
BindingDB Entry DOI: 10.7270/Q2RF5SQR
Serine/threonine-protein kinase/endoribonuclease IRE1 Alpha
(Homo sapiens (Human))
BDBM110990
(US8614253, 3-21 | US9241942, 3-21 | US9963434, Com...)
Show SMILES Oc1c(C=O)cc(Cl)cc1C=O
Show InChI InChI=1S/C8H5ClO3/c9-7-1-5(3-10)8(12)6(2-7)4-11/h1-4,12H
Reactome pathway
US Patent
n/an/a 400n/an/an/an/an/an/a
Novartis
Assay Description
A fusion protein comprising glutathione S transferase (GST) and human IRE-1α (GST-IRE-1α) was obtained from a 500 ml baculovirus-infected i...
J Med Chem 52: 3523-38 (2009)
BindingDB Entry DOI: 10.7270/Q2BK1FQR
Serine/threonine-protein kinase/endoribonuclease IRE1 Alpha
(Homo sapiens (Human))
BDBM110990
(US8614253, 3-21 | US9241942, 3-21 | US9963434, Com...)
Show SMILES Oc1c(C=O)cc(Cl)cc1C=O
Show InChI InChI=1S/C8H5ClO3/c9-7-1-5(3-10)8(12)6(2-7)4-11/h1-4,12H
Reactome pathway
US Patent
n/an/a 400n/an/an/an/a7.5n/a
MannKind Corporation
US Patent
Assay Description
A fusion protein comprising glutathione S transferase (GST) and human IRE-1α (GST-IRE-1α) was obtained from a 500 ml baculovirus-infected i...
US Patent US9241942 (2016)
BindingDB Entry DOI: 10.7270/Q25B0192