BDBM111446 N-[2-Hydroxymethyl-5-(5-methyl-2,4-dioxo-3,4-dihydro- 2H-pyrimidin-1-yl)-tetrahydro-furan-3-yl]-oxalamic acid (Compound 5)
SMILES: Cc1cn([C@H]2C[C@@H](NC(=O)C(O)=O)[C@@H](CO)O2)c(=O)[nH]c1=O
InChI Key: InChIKey=NUOQPEKNHWXSKJ-BWZBUEFSSA-N
Data: 2 KI
Activity Spreadsheet -- Enzyme Inhibition Constant Data from BindingDB
Found 2 hits for monomerid = 111446
Trg + Lig
Ki
nM
ΔG°
kcal/mole
IC50
nM
Kd
nM
EC50/IC50
nM
koff
s-1
kon
M-1s-1
pHTemp
°C
RNAse A
(Homo sapiens (Human))
BDBM111446
(N-[2-Hydroxymethyl-5-(5-methyl-2,4-dioxo-3,4-dihyd...)
Show SMILES Cc1cn([C@H]2C[C@@H](NC(=O)C(O)=O)[C@@H](CO)O2)c(=O)[nH]c1=O |r|
Show InChI InChI=1S/C12H15N3O7/c1-5-3-15(12(21)14-9(5)17)8-2-6(7(4-16)22-8)13-10(18)11(19)20/h3,6-8,16H,2,4H2,1H3,(H,13,18)(H,19,20)(H,14,17,21)/t6-,7-,8-/m1/s1
1.32E+5n/an/an/an/an/an/an/an/a
SASTRA University, Thanjavur, Tamil Nadu 613401, India
Bioorg Chem 52: 56-61 (2014)
Article DOI: 10.1016/j.bioorg.2013.11.005
BindingDB Entry DOI: 10.7270/Q2MP51ZZ
Angiogenin
(Homo sapiens (Human))
BDBM111446
(N-[2-Hydroxymethyl-5-(5-methyl-2,4-dioxo-3,4-dihyd...)
Show SMILES Cc1cn([C@H]2C[C@@H](NC(=O)C(O)=O)[C@@H](CO)O2)c(=O)[nH]c1=O |r|
Show InChI InChI=1S/C12H15N3O7/c1-5-3-15(12(21)14-9(5)17)8-2-6(7(4-16)22-8)13-10(18)11(19)20/h3,6-8,16H,2,4H2,1H3,(H,13,18)(H,19,20)(H,14,17,21)/t6-,7-,8-/m1/s1
7.75E+5n/an/an/an/an/an/a6.0n/a
SASTRA University, Thanjavur, Tamil Nadu 613401, India
Assay Description
The assay was carried out in oligovinylsulfonic acid free 0.1 M Mes-NaOH buffer (pH 6.0) containing 0.1 M NaCl using substrate concentration from 20 ...
Bioorg Chem 52: 56-61 (2014)
Article DOI: 10.1016/j.bioorg.2013.11.005
BindingDB Entry DOI: 10.7270/Q2MP51ZZ