BDBM11232 N-[(benzyloxy)carbonyl]-O-(tert-butyl)-L-threonyl-N1-((1S,2E)-4-ethoxy-4-oxo-1-{[(3S)-2-oxopyrrolidin-3-yl]methyl}but-2-enyl)-L-leucinamide::TG-0203770::TG-0205221 Analogue 4::ethyl (2E,4S)-4-[(2S)-2-[(2S,3S)-2-{[(benzyloxy)carbonyl]amino}-3-(tert-butoxy)butanamido]-4-methylpentanamido]-5-[(3S)-2-oxopyrrolidin-3-yl]pent-2-enoate
SMILES: CCOC(=O)\C=C\[C@H](C[C@@H]1CCNC1=O)NC(=O)[C@H](CC(C)C)NC(=O)[C@@H](NC(=O)OCc1ccccc1)C(C)OC(C)(C)C
InChI Key: InChIKey=PWBQMVUCCVWDEJ-YVSZZSSPSA-N
Data: 3 KI
Activity Spreadsheet -- Enzyme Inhibition Constant Data from BindingDB
Found 4 hits for monomerid = 11232
Trg + Lig
Ki
nM
ΔG°
kcal/mole
IC50
nM
Kd
nM
EC50/IC50
nM
koff
s-1
kon
M-1s-1
pHTemp
°C
3C-like proteinase (3CL-PRO)
(Human SARS coronavirus (SARS-CoV) (Severe acute re...)
BDBM11232
(N-[(benzyloxy)carbonyl]-O-(tert-butyl)-L-threonyl-...)
Show SMILES CCOC(=O)\C=C\[C@H](C[C@@H]1CCNC1=O)NC(=O)[C@H](CC(C)C)NC(=O)[C@@H](NC(=O)OCc1ccccc1)C(C)OC(C)(C)C |r|
Show InChI InChI=1S/C33H50N4O8/c1-8-43-27(38)15-14-25(19-24-16-17-34-29(24)39)35-30(40)26(18-21(2)3)36-31(41)28(22(4)45-33(5,6)7)37-32(42)44-20-23-12-10-9-11-13-23/h9-15,21-22,24-26,28H,8,16-20H2,1-7H3,(H,34,39)(H,35,40)(H,36,41)(H,37,42)/b15-14+/t22?,24-,25+,26-,28-/m0/s1
58 -9.87n/an/an/an/an/a7.525
TaiGen Biotechnology Co.
Assay Description
The effects of compound on enzyme activity were measured by using peptide cleavage assay. Cleavage products were resolved and analyzed with a reverse...
J Med Chem 49: 4971-80 (2006)
Article DOI: 10.1021/jm0603926
BindingDB Entry DOI: 10.7270/Q24B2ZJT
3C-like proteinase (3CL-PRO)
(Human SARS coronavirus (SARS-CoV) (Severe acute re...)
BDBM11232
(N-[(benzyloxy)carbonyl]-O-(tert-butyl)-L-threonyl-...)
Show SMILES CCOC(=O)\C=C\[C@H](C[C@@H]1CCNC1=O)NC(=O)[C@H](CC(C)C)NC(=O)[C@@H](NC(=O)OCc1ccccc1)C(C)OC(C)(C)C |r|
Show InChI InChI=1S/C33H50N4O8/c1-8-43-27(38)15-14-25(19-24-16-17-34-29(24)39)35-30(40)26(18-21(2)3)36-31(41)28(22(4)45-33(5,6)7)37-32(42)44-20-23-12-10-9-11-13-23/h9-15,21-22,24-26,28H,8,16-20H2,1-7H3,(H,34,39)(H,35,40)(H,36,41)(H,37,42)/b15-14+/t22?,24-,25+,26-,28-/m0/s1
58n/an/an/an/an/an/an/an/a
TBA
Citation and Details
3C-like proteinase (3CL-PRO)
(Human SARS coronavirus (SARS-CoV) (Severe acute re...)
BDBM11232
(N-[(benzyloxy)carbonyl]-O-(tert-butyl)-L-threonyl-...)
Show SMILES CCOC(=O)\C=C\[C@H](C[C@@H]1CCNC1=O)NC(=O)[C@H](CC(C)C)NC(=O)[C@@H](NC(=O)OCc1ccccc1)C(C)OC(C)(C)C |r|
Show InChI InChI=1S/C33H50N4O8/c1-8-43-27(38)15-14-25(19-24-16-17-34-29(24)39)35-30(40)26(18-21(2)3)36-31(41)28(22(4)45-33(5,6)7)37-32(42)44-20-23-12-10-9-11-13-23/h9-15,21-22,24-26,28H,8,16-20H2,1-7H3,(H,34,39)(H,35,40)(H,36,41)(H,37,42)/b15-14+/t22?,24-,25+,26-,28-/m0/s1
58 -9.87n/an/an/an/an/a6.525
National Yang-Ming University
Assay Description
Peptidomimetic inhibitors against CVB3 3Cpro and SARS-CoV 3CLpro. The inhibition constant of SARS 3CLpro was analyzed with reverse-phase HPLC using a...
J Biol Chem 284: 7646-55 (2009)
Article DOI: 10.1074/jbc.M807947200
BindingDB Entry DOI: 10.7270/Q2SN07KT
3C-like proteinase (CVB3 3Cpro)
(Coxsackievirus B3 (strain Nancy))
BDBM11232
(N-[(benzyloxy)carbonyl]-O-(tert-butyl)-L-threonyl-...)
Show SMILES CCOC(=O)\C=C\[C@H](C[C@@H]1CCNC1=O)NC(=O)[C@H](CC(C)C)NC(=O)[C@@H](NC(=O)OCc1ccccc1)C(C)OC(C)(C)C |r|
Show InChI InChI=1S/C33H50N4O8/c1-8-43-27(38)15-14-25(19-24-16-17-34-29(24)39)35-30(40)26(18-21(2)3)36-31(41)28(22(4)45-33(5,6)7)37-32(42)44-20-23-12-10-9-11-13-23/h9-15,21-22,24-26,28H,8,16-20H2,1-7H3,(H,34,39)(H,35,40)(H,36,41)(H,37,42)/b15-14+/t22?,24-,25+,26-,28-/m0/s1
1.50E+3 -7.94n/an/an/an/an/a6.525
National Yang-Ming University
Assay Description
Peptidomimetic inhibitors against CVB3 3Cpro and SARS-CoV 3CLpro. The inhibition constant of SARS 3CLpro was analyzed with reverse-phase HPLC using a...
J Biol Chem 284: 7646-55 (2009)
Article DOI: 10.1074/jbc.M807947200
BindingDB Entry DOI: 10.7270/Q2SN07KT