BDBM11265 N-(4-chlorophenyl)-2-[(4-{5-[1-methyl-5-(trifluoromethyl)-1H-pyrazol-3-yl]thiophen-2-yl}pyrimidin-2-yl)sulfanyl]acetamide::jm5b01461, Compound 106::pyrimidine-containing compound 2
SMILES: Cn1nc(cc1C(F)(F)F)-c1ccc(s1)-c1ccnc(SCC(=O)Nc2ccc(Cl)cc2)n1
InChI Key: InChIKey=AWQBIBTZJKFLEW-UHFFFAOYSA-N
Data: 2 IC50
Activity Spreadsheet -- Enzyme Inhibition Constant Data from BindingDB
Found 3 hits for monomerid = 11265
Trg + Lig
Ki
nM
ΔG°
kcal/mole
IC50
nM
Kd
nM
EC50/IC50
nM
koff
s-1
kon
M-1s-1
pHTemp
°C
3C-like proteinase (3CL-PRO)
(Human SARS coronavirus (SARS-CoV) (Severe acute re...)
BDBM11265
(N-(4-chlorophenyl)-2-[(4-{5-[1-methyl-5-(trifluoro...)
Show SMILES Cn1nc(cc1C(F)(F)F)-c1ccc(s1)-c1ccnc(SCC(=O)Nc2ccc(Cl)cc2)n1
Show InChI InChI=1S/C21H15ClF3N5OS2/c1-30-18(21(23,24)25)10-15(29-30)17-7-6-16(33-17)14-8-9-26-20(28-14)32-11-19(31)27-13-4-2-12(22)3-5-13/h2-10H,11H2,1H3,(H,27,31)
n/an/a 1.00E+4n/an/an/an/a7.025
National Tsing Hua University
Assay Description
The effects of compound on enzyme activity were measured by using a fluorogenic peptide cleavage assay. Enhanced fluorescence caused by cleavage of t...
J Med Chem 49: 3485-95 (2006)
Article DOI: 10.1021/jm050852f
BindingDB Entry DOI: 10.7270/Q2R20ZKB
3C-like proteinase (3CL-PRO)
(Human SARS coronavirus (SARS-CoV) (Severe acute re...)
BDBM11265
(N-(4-chlorophenyl)-2-[(4-{5-[1-methyl-5-(trifluoro...)
Show SMILES Cn1nc(cc1C(F)(F)F)-c1ccc(s1)-c1ccnc(SCC(=O)Nc2ccc(Cl)cc2)n1
Show InChI InChI=1S/C21H15ClF3N5OS2/c1-30-18(21(23,24)25)10-15(29-30)17-7-6-16(33-17)14-8-9-26-20(28-14)32-11-19(31)27-13-4-2-12(22)3-5-13/h2-10H,11H2,1H3,(H,27,31)
n/an/a 1.00E+4n/an/an/an/an/an/a
TBA
Citation and Details
3C-like proteinase (3CL-PRO)
(Human SARS coronavirus (SARS-CoV) (Severe acute re...)
BDBM11265
(N-(4-chlorophenyl)-2-[(4-{5-[1-methyl-5-(trifluoro...)
Show SMILES Cn1nc(cc1C(F)(F)F)-c1ccc(s1)-c1ccnc(SCC(=O)Nc2ccc(Cl)cc2)n1
Show InChI InChI=1S/C21H15ClF3N5OS2/c1-30-18(21(23,24)25)10-15(29-30)17-7-6-16(33-17)14-8-9-26-20(28-14)32-11-19(31)27-13-4-2-12(22)3-5-13/h2-10H,11H2,1H3,(H,27,31)
n/an/a 1.00E+4n/an/an/an/an/an/a
University of Bonn
Assay Description
This is a review article.
J Med Chem 59: 6595-628 (2016)
Article DOI: 10.1021/acs.jmedchem.5b01461
BindingDB Entry DOI: 10.7270/Q2PK0JH1